{"text_format":"1","workbook":"xlsx","n_sheets":8,"sheets":["サンプルの発送方法","【A】Sequencing information","【B】Sample information","【C】index information","【D】Comparison Pair information","【E】Sample Prep. information","サンプル条件一覧","マクロジェン使用欄"],"not_rendered":{"charts":0,"images":7,"macros":1,"external_links":0,"defined_names":54,"comments":0,"pivot_tables":0},"unopened":[],"bounds":{"document_bytes":16777216,"sheet_cells":100000,"rows_first":2000,"rows_last":500,"rows_between":2000,"halvings":0,"cell_chars":16384,"cell_head_chars":4096},"cells_cut":0,"cells_raw":0,"read":"whole","date_system":"1900"}

{"sheet":"サンプルの発送方法","index":0,"n_rows":63,"n_cols":18,"rows_kept":63,"cut":false,"hidden":false,"merged":[[34,0,34,9]]}
["サンプル発送準備の注意事項"]
[]
[]
[]
[]
[]
[]
[]
[]
[]
[]
[]
["１）弊社で指定するチューブはございませんが、なるべく1.5mlもしくは2mlチューブをお使いください。"]
[]
["２）サンプル名もしくはTube IDをサンプルチューブの蓋に正しく記載をお願い致します。"]
["　　サンプル名とチューブの蓋に記載されている名前が異なる場合は、Tube IDを【B】Sample informationに記載してください。"]
["　　Tube ID・サンプル名には記号や日本語の記載は行わず、アルファベットもしくは数字のみを使用してください。"]
[]
["３）液量は可能な限り多めにご準備をお願い致します。微量の場合、輸送時に蒸発する場合がございます。"]
[]
["４）チューブに破損が無いことを確認し、チューブの蓋はしっかりと締めてください。"]
[null,null,null,null,null,null,null,null,null,null,null,null,null,null,"※Sample nameはイメージとなります。"]
["５）チューブは小箱に【B】シートに記載の順に並べて入れてください。箱の周りは緩衝材で保護してください。"]
["　　小箱やチューブ立てが無い場合は緩衝材で十分にくるんでご送付をお願い致します。",null,null,null,null,null,null,null,null,null,null,null,null,null,"サンプル発送費用"]
["　　緩衝材が無い場合、ドライアイスや保冷材にチューブが挟まり、チューブが破損する可能性がございます。",null,null,null,null,null,null,null,null,null,null,null,null,null,"・サンプルは着払いでお送りいただけます。（MiSeqの場合はご確認ください）"]
[null,null,null,null,null,null,null,null,null,null,null,null,null,null,"・弊社へサンプルを送付される際、海外からの輸送や特殊・高額な輸送方法（臨床検体用の専門輸送等）は、"]
["６）サンプルがDNA/調整済ライブラリの場合はスチロールボックスに保冷剤を同梱してください。",null,null,null,null,null,null,null,null,null,null,null,null,null,"　お客様のご負担（元払い）でお願い致します。"]
["　　サンプルがRNAもしくは組織/細胞サンプルの場合はスチロールボックスにドライアイスを十分同梱してください。",null,null,null,null,null,null,null,null,null,null,null,null,null,"※通常輸送はヤマト運輸/佐川急便/ゆうパック/日通航空等の基本クール宅配便を想定しております。"]
[]
["７）オーダーシート（【A】Sequencing information Sheet、【B】Sample information Sheet）と発送内容確認書を",null,null,null,null,null,null,null,null,null,null,null,null,null,"サンプルの発送先住所、電話番号"]
{"$rows_left_out":34}
{"sheet":"【A】Sequencing information","index":1,"n_rows":60,"n_cols":6,"rows_kept":60,"cut":false,"hidden":false,"merged":[[11,0,11,3],[59,0,59,8],[5,0,5,4],[3,0,3,5],[26,1,26,2],[25,1,25,2],[10,1,10,2],[7,1,7,2],[8,1,8,2],[23,1,23,2],[53,0,53,8],[9,1,9,2],[19,1,19,2],[20,1,20,2],[22,1,22,2],[24,1,24,2],[14,1,14,2],[15,1,15,2],[16,1,16,2],[17,1,17,2],[18,1,18,2],[56,0,56,3],[55,0,55,3],[33,0,33,3],[29,0,31,3],[54,0,54,6],[27,1,27,2],[40,0,41,3],[43,0,43,3],[44,0,49,3],[50,0,51,3],[28,0,28,3],[34,0,39,3]]}
["Macrogen Japan NGS Service Order Sheet 3.1"]
["赤枠は必須項目です。全ての項目をご記入ください。"]
["サンプルによってシーケンス条件が異なる場合、ご請求を分割する必要がある場合は、条件ごとにオーダーシートを作成ください。"]
["サンプル発送時にこのファイルを jutaku_gr@cosmobio.co.jp 宛にお送りください。"]
["【A】Sequencing informationと【B】Sample information シートは印刷後、サンプルに同梱いただきますようお願い申し上げます。"]
["お客様IDをお持ちでない場合はこちらからユーザー登録をお願い致します。"]
[]
["お客様ID","MJ19100309616",null,null,null,{"$f":"IF(OR(B15=\"NovaSeq6000\",B15=\"NovaSeq_X_Plus\",B15=\"MiSeq\",B15=\"PacBio_Revio\"),\"J\",\"K\")","v":"K"}]
["ご氏名",null,null,null,null,{"$f":"IF(OR(B16=\"Whole_Genome_Sequencing \",B16=\"Library_Sequencing\",B16=\"Exome_Sequencing\",B16=\"Transcriptome_Sequencing\",B16=\"Metagenome_Shotgun_Sequencing\",B16=\"Metagenome_16s_18s_Sequencing\",B16=\"Amplicon_Sequencing\"),\"J\",\"K\")","v":"K"}]
["代理店名","コスモ・バイオ（株）",null,null,null,{"$f":"IF(OR(B17=\"TruSeq DNA PCR-free Library\",B17=\"TruSeq Nano DNA Library\",B17=\"TruSeq stranded mRNA Library\",B17=\"TruSeq stranded Total RNA / Ribo-zero Plus\",B17=\"TruSeq RNA Exome(Access)\",B17=\"SMRTbell Prep Kit\",B17=\"SureSelect Human V6\",B17=\"調製済み\",B17=\"16S rRNA(V3-V4)　1stPCRから\",B17=\"18S rRNA(ITS)　1stPCRから\",B17=\"Amplicon　2ndPCRから\"),\"J\",\"K\")","v":"K"}]
["代理店担当者",null,null,null,null,{"$f":"IF(OR(B24=\"Raw Data\",B24=\"SNP/Short INDEL解析\",B24=\"SNP+SV+CNV\",B24=\"DEG\",B24=\"DEG + Splicing\",B24=\"DEG + Splicing + Fusion Gene\",B24=\"Mapping\",B24=\"FPKM/TPM\"),\"J\",\"K\")","v":"K"}]
["こちらから弊社プライバシーポリシーをご確認いただき、ご同意の上ご発注ください。",null,null,null,null,{"$f":"IF(OR(C22=\"lane/Run/Cell\",C22=\"Gb/sample\"),\"J\",\"K\")","v":"K"}]
[]
[]
["Platform","選択してください",null,{"$f":"IF(B15=\"選択してください\",\"\",VLOOKUP(B15,マクロジェン使用欄!$A$156:$B$163,2,FALSE))","v":""}]
["Application","選択してください",null,{"$f":"IF(B16=\"選択してください\",\"\",VLOOKUP(B16,マクロジェン使用欄!$P$1:$Q$14,2,FALSE))","v":""}]
["Library Prep. Kit","選択してください",null,{"$f":"IF(B17=\"選択してください\",\"\",VLOOKUP(B17,マクロジェン使用欄!$A$37:$B$75,2,FALSE))","v":""}]
["備考"]
["シーケンス方法","選択してください",null,{"$f":"IF(B19=\"選択してください\",\"\",VLOOKUP(B19,マクロジェン使用欄!$D$32:$E$34,2,FALSE))","v":""}]
["Layout","選択してください"]
["Read Length","選択してください",null,{"$f":"IF(B21=\"選択してください\",\"\",VLOOKUP(B21,マクロジェン使用欄!$A$26:$B$32,2,FALSE))","v":""}]
["Run Scale",null,"選択してください",{"$f":"IF(C22=\"選択してください\",\"\",VLOOKUP(C22,マクロジェン使用欄!$D$35:$E$39,2,FALSE))","v":""}]
["Sample Number"]
["Data Analysis","選択してください",null,{"$f":"IF(B24=\"選択してください\",\"\",VLOOKUP(B24,マクロジェン使用欄!A76:B98,2,FALSE))","v":""}]
["納品形態","選択してください",null,{"$f":"IF(B25=\"選択してください\",\"\",VLOOKUP(B25,マクロジェン使用欄!A99:B101,2,FALSE))","v":""}]
["実験進行","選択してください",null,{"$f":"IF(B26=\"選択してください\",\"\",VLOOKUP(B26,マクロジェン使用欄!A133:B134,2,FALSE))","v":""}]
["サンプル返送","選択してください",null,{"$f":"IF(B27=\"選択してください\",\"\",VLOOKUP(B27,マクロジェン使用欄!A103:B104,2,FALSE))","v":""}]
["希望納期","yyyy/mm/dd"]
[{"$f":"IF(B24=\"選択してください\",\"\",IF(B24=\"Raw Data\",\"\",\"弊社で使用しますリファレンスとアノテーションファイルは不定期に更新を致します。以前の案件と連携するデータ解析をご希望の場合は必ず事前にご相談下さい。\"))","v":""}]
["本シートご記入後、【B】Sample informationシートもご記入ください\nサンプルの条件や発送方法に関しましては各シートをご参照ください\nお預かりしたサンプル及び解析データの保管期間は解析結果発送後3ヵ月までです"]
{"$rows_left_out":31}
{"sheet":"【B】Sample information","index":2,"n_rows":34,"n_cols":8,"rows_kept":34,"cut":false,"hidden":false,"merged":[[2,0,2,1],[11,2,12,2],[2,2,2,5],[3,2,3,5],[4,2,4,5],[5,2,5,5],[6,2,6,5],[7,2,7,5],[3,0,3,1],[5,0,5,1],[6,0,6,1],[7,0,7,1],[4,0,4,1],[11,4,12,4],[11,5,12,5],[11,6,12,6],[11,7,12,7],[9,0,9,7],[11,0,12,0],[11,1,12,1]]}
["Macrogen Japan NGS Service Sample Information Sheet"]
["赤枠は必須項目です。必ずご記入ください。"]
["発送種類",null,"選択してください"]
["サンプル生物種",null,"選択してください"]
["サンプル学名"]
["サンプル種類",null,"選択してください",null,null,null,{"$f":"IF(C6=\"選択してください\",\"\",VLOOKUP(C6,マクロジェン使用欄!$A$110:$B$123,2,FALSE))","v":""}]
["サンプルの由来",null,"選択してください"]
["発送サンプル(チューブ)数"]
[]
["調製済みライブラリをお送りいただく際はプーリングしたチューブの情報をご記入ください。\n個別のサンプル情報は【C】index informationシートにご記入ください。\nTube IDの欄には、実際のTube topに記載されている名前、番号をご記入ください。"]
[]
["Item No.","Sample name\n(15文字以内)","Tube ID","濃度(選択してください)","液量\n(ul)","純度 \n(A260/280)","溶出バッファー \n(Elution Buffer)","エタノール\n沈殿状態"]
[null,null,null,"測定方法(選択して下さい)"]
["例","Test1",1,20,50,1.82,"H2O","-"]
[1,null,null,null,null,null,null,"-"]
[2,null,null,null,null,null,null,"-"]
[3,null,null,null,null,null,null,"-"]
[4,null,null,null,null,null,null,"-"]
[5,null,null,null,null,null,null,"-"]
[6,null,null,null,null,null,null,"-"]
[7,null,null,null,null,null,null,"-"]
[8,null,null,null,null,null,null,"-"]
[9,null,null,null,null,null,null,"-"]
[10,null,null,null,null,null,null,"-"]
[11,null,null,null,null,null,null,"-"]
[12,null,null,null,null,null,null,"-"]
[13,null,null,null,null,null,null,"-"]
[14,null,null,null,null,null,null,"-"]
[15,null,null,null,null,null,null,"-"]
[16,null,null,null,null,null,null,"-"]
{"$rows_left_out":5}
{"sheet":"【C】index information","index":3,"n_rows":390,"n_cols":7,"rows_kept":390,"cut":false,"hidden":false,"merged":[[14,0,15,0],[14,1,15,1],[6,0,6,1],[6,2,6,3],[9,0,9,3],[7,0,7,1],[7,2,7,3],[8,0,8,1],[11,1,11,3],[1,0,1,3],[2,0,2,3],[4,0,4,1],[4,2,4,3],[5,0,5,1],[5,2,5,3],[3,0,3,1],[3,2,3,3]]}
["こちらのシートは調製済みライブラリをサンプルとしてご提供いただくお客様のみご記入ください。"]
["Macrogen Japan NGS Service index imformation sheet"]
["＜注意事項＞\n・赤枠は必須項目となります。全ての項目をご記入ください。\n・1つのpoolingライブラリにつき1シートのご準備をお願いします。\n・複数ライブラリーをご送付いただく際はこちらのシートのコピーをお願いします。\n・ライブラリサンプルはシーケンスlane単位で1本のチューブにおまとめ頂きご発送ください。\n・Single indexの場合はi5側は空欄でお願いします。\n・10x Chromiumで作成されたライブラリーのように、1サンプルにつき複数indexがある場合は、\n　右図の様に1サンプルで複数行を使用して、i7側にそれぞれのindex配列をご記入下さい。"]
["サンプルチューブ名"]
["ライブラリ調製キット名:\n※使用が無ければ「無し」と記載をお願い致します。"]
["Library Size(bp): "]
["PhiX添加必要量(%):\n※弊社で添加をご希望の場合(無償)\n※添加しない場合は0とご記入ください"]
["Poolingサンプル数"]
["サンプルが10x genomics社 Chromiumで\n調製されたライブラリーの場合"]
[]
[]
[]
[]
[null,"Sample Name(15文字以内)","i5側index配列","i7側index配列"]
["例","macrogen-1","機種にかかわらず、MiSeq,HiSeq2000/2500,\nNovaSeq v1.0側に記載の配列をご記入ください。","i7 Bases for Sample Sheet\nに記載のある配列をご記入ください。"]
[null,null,"TAGATCGC","TCGCCTTA"]
[1,null,null,null,{"$f":"IF(COUNTIF($B$17:$B390,B17)>1,\"サンプル名が重複しています\",\"\")","v":""},{"$f":"IF(D17=\"\",\"\",IF(D17>1,C17&D17))","v":""},{"$f":"IF(F17=\"\",\"\",IF(COUNTIF($F$17:$F$390,F17)>1,\"indexが重複しています\",\"\"))","v":""}]
[2,null,null,null,{"$f":"IF(COUNTIF($B$17:$B391,B18)>1,\"サンプル名が重複しています\",\"\")","v":""},{"$f":"IF(D18=\"\",\"\",IF(D18>1,C18&D18))","v":""},{"$f":"IF(F18=\"\",\"\",IF(COUNTIF($F$17:$F$390,F18)>1,\"indexが重複しています\",\"\"))","v":""}]
[3,null,null,null,{"$f":"IF(COUNTIF($B$17:$B392,B19)>1,\"サンプル名が重複しています\",\"\")","v":""},{"$f":"IF(D19=\"\",\"\",IF(D19>1,C19&D19))","v":""},""]
[4,null,null,null,{"$f":"IF(COUNTIF($B$17:$B393,B20)>1,\"サンプル名が重複しています\",\"\")","v":""},{"$f":"IF(D20=\"\",\"\",IF(D20>1,C20&D20))","v":""},""]
[5,null,null,null,{"$f":"IF(COUNTIF($B$17:$B394,B21)>1,\"サンプル名が重複しています\",\"\")","v":""},"",""]
[6,null,null,null,{"$f":"IF(COUNTIF($B$17:$B395,B22)>1,\"サンプル名が重複しています\",\"\")","v":""},"",""]
[7,null,null,null,{"$f":"IF(COUNTIF($B$17:$B396,B23)>1,\"サンプル名が重複しています\",\"\")","v":""},"",""]
[8,null,null,null,{"$f":"IF(COUNTIF($B$17:$B397,B24)>1,\"サンプル名が重複しています\",\"\")","v":""},"",""]
[9,null,null,null,{"$f":"IF(COUNTIF($B$17:$B398,B25)>1,\"サンプル名が重複しています\",\"\")","v":""},"",""]
[10,null,null,null,{"$f":"IF(COUNTIF($B$17:$B399,B26)>1,\"サンプル名が重複しています\",\"\")","v":""},"",""]
[11,null,null,null,{"$f":"IF(COUNTIF($B$17:$B400,B27)>1,\"サンプル名が重複しています\",\"\")","v":""},"",""]
[12,null,null,null,{"$f":"IF(COUNTIF($B$17:$B401,B28)>1,\"サンプル名が重複しています\",\"\")","v":""},"",""]
[13,null,null,null,{"$f":"IF(COUNTIF($B$17:$B402,B29)>1,\"サンプル名が重複しています\",\"\")","v":""},"",""]
[14,null,null,null,{"$f":"IF(COUNTIF($B$17:$B403,B30)>1,\"サンプル名が重複しています\",\"\")","v":""},"",""]
{"$rows_left_out":361}
{"sheet":"【D】Comparison Pair information","index":4,"n_rows":125,"n_cols":22,"rows_kept":125,"cut":false,"hidden":false,"merged":[[12,14,12,16],[13,18,14,18],[13,19,14,19],[13,20,14,20],[13,21,14,21],[28,20,29,20],[28,21,29,21],[26,12,26,13],[27,14,27,16],[28,18,29,18],[28,19,29,19],[4,8,5,8],[4,9,5,9],[1,0,1,4],[1,6,1,9],[4,6,5,6],[4,7,5,7],[3,2,3,4],[2,0,2,4],[10,12,11,13],[4,21,5,21],[2,12,2,13],[3,14,3,16],[4,18,5,18],[4,19,5,19],[4,20,5,20]]}
["こちらのシートは弊社にてサンプル間の比較解析（DEG解析）を実施するお客様のみご記入ください。"]
["インフォマティクス解析でサンプル(群)間の比較をご希望の際は、\n比較するサンプルのグループ名をご指定ください (n=1の場合はサンプル名=グループ名)。\nグループ名は半角英数字 15文字以内で設定お願いします（記号は-及び_のみ使用可能）。\n\n1サンプルを複数グループでの比較に使用する場合は、\nSample Group Nameを複数設定お願いします（右側記入例2）。\n※Sample Nameは【B】Sample information Sheetに記入いただいたものが反映されます。",null,null,null,null,null,"比較パターンをサンプルグループ名でご記入ください。\n比較パターンは必ず Test vs Control の順でご記入ください。\n\n比較パターンの数によって追加費用がかかることがございます。\n再度データ解析を行います際は追加費用が発生することがございます。"]
["※n=1で比較を行う際はサンプル名＝グループ名となるため、\n右側の比較パターンのみのご記入で問題ございません。",null,null,null,null,null,null,null,null,null,null,null,"記入例1 "]
[null,"Sample name","Sample Group name(15文字以内)",null,null,null,null,"Test Sample Group Name",null,"Control Sample Group Name",null,null,null,"Sample name","Sample Group name",null,null,null,null,"Test Sample Group Name",null,"Control Sample Group Name"]
["例1",1,"WT",null,null,null,"例","KO","vs","WT",null,null,1,"ControlA","Control",null,null,null,"例","KO","vs","WT"]
["例2",2,"KO",null,null,null,null,null,null,null,null,null,2,"ControlB","Control"]
[1,{"$f":"IF('【B】Sample information'!B15=\"\",\"\",'【B】Sample information'!B15)","v":""},null,null,null,null,1,null,"vs",null,null,null,3,"DrugA","Drug",null,null,null,1,"Drug","vs","Control"]
[2,{"$f":"IF('【B】Sample information'!B16=\"\",\"\",'【B】Sample information'!B16)","v":""},null,null,null,null,2,null,"vs",null,null,null,4,"DrugB","Drug",null,null,null,2,"DrugA","vs","ControlA"]
[3,{"$f":"IF('【B】Sample information'!B17=\"\",\"\",'【B】Sample information'!B17)","v":""},null,null,null,null,3,null,"vs",null,null,null,null,null,null,null,null,null,3,"DrugB","vs","ControlB"]
[4,{"$f":"IF('【B】Sample information'!B18=\"\",\"\",'【B】Sample information'!B18)","v":""},null,null,null,null,4,null,"vs"]
[5,{"$f":"IF('【B】Sample information'!B19=\"\",\"\",'【B】Sample information'!B19)","v":""},null,null,null,null,5,null,"vs",null,null,null,"記入例2"]
[6,{"$f":"IF('【B】Sample information'!B20=\"\",\"\",'【B】Sample information'!B20)","v":""},null,null,null,null,6,null,"vs"]
[7,{"$f":"IF('【B】Sample information'!B21=\"\",\"\",'【B】Sample information'!B21)","v":""},null,null,null,null,7,null,"vs",null,null,null,null,"Sample name","Sample Group name",null,null,null,null,"Test Sample Group Name",null,"Control Sample Group Name"]
[8,{"$f":"IF('【B】Sample information'!B22=\"\",\"\",'【B】Sample information'!B22)","v":""},null,null,null,null,8,null,"vs",null,null,null,1,1,"0h","0h-1",null,null,"例","KO","vs","WT"]
[9,{"$f":"IF('【B】Sample information'!B23=\"\",\"\",'【B】Sample information'!B23)","v":""},null,null,null,null,9,null,"vs",null,null,null,2,2,"0h","0h-1"]
[10,{"$f":"IF('【B】Sample information'!B24=\"\",\"\",'【B】Sample information'!B24)","v":""},null,null,null,null,10,null,"vs",null,null,null,3,3,"0h",null,null,null,1,"24h","vs","0h"]
[11,{"$f":"IF('【B】Sample information'!B25=\"\",\"\",'【B】Sample information'!B25)","v":""},null,null,null,null,11,null,"vs",null,null,null,4,4,"0h","0h-1",null,null,2,"24h-1","vs","0h-1"]
[12,{"$f":"IF('【B】Sample information'!B26=\"\",\"\",'【B】Sample information'!B26)","v":""},null,null,null,null,12,null,"vs",null,null,null,5,5,"12h","12h-1",null,null,3,"12h","vs","0h"]
[13,{"$f":"IF('【B】Sample information'!B27=\"\",\"\",'【B】Sample information'!B27)","v":""},null,null,null,null,13,null,"vs",null,null,null,6,6,"12h",null,null,null,4,"12h-1","vs","0h-1"]
[14,{"$f":"IF('【B】Sample information'!B28=\"\",\"\",'【B】Sample information'!B28)","v":""},null,null,null,null,14,null,"vs",null,null,null,7,7,"12h","12h-1",null,null,5,"24h","vs","12h"]
[15,{"$f":"IF('【B】Sample information'!B29=\"\",\"\",'【B】Sample information'!B29)","v":""},null,null,null,null,15,null,"vs",null,null,null,8,8,"12h","12h-1",null,null,6,"24h-1","vs","12h-1"]
[16,{"$f":"IF('【B】Sample information'!B30=\"\",\"\",'【B】Sample information'!B30)","v":""},null,null,null,null,16,null,"vs",null,null,null,9,9,"24h","24h-1"]
[17,{"$f":"IF('【B】Sample information'!B31=\"\",\"\",'【B】Sample information'!B31)","v":""},null,null,null,null,17,null,"vs",null,null,null,10,10,"24h","24h-1"]
[18,{"$f":"IF('【B】Sample information'!B32=\"\",\"\",'【B】Sample information'!B32)","v":""},null,null,null,null,18,null,"vs",null,null,null,11,11,"24h","24h-1"]
[19,{"$f":"IF('【B】Sample information'!B33=\"\",\"\",'【B】Sample information'!B33)","v":""},null,null,null,null,19,null,"vs",null,null,null,12,12,"24h"]
[20,{"$f":"IF('【B】Sample information'!B34=\"\",\"\",'【B】Sample information'!B34)","v":""},null,null,null,null,20,null,"vs"]
[null,{"$f":"IF('【B】Sample information'!B35=\"\",\"\",'【B】Sample information'!B35)","v":""}]
[null,{"$f":"IF('【B】Sample information'!B36=\"\",\"\",'【B】Sample information'!B36)","v":""}]
[null,{"$f":"IF('【B】Sample information'!B37=\"\",\"\",'【B】Sample information'!B37)","v":""}]
[null,{"$f":"IF('【B】Sample information'!B38=\"\",\"\",'【B】Sample information'!B38)","v":""}]
{"$rows_left_out":96}
{"sheet":"【E】Sample Prep. information","index":5,"n_rows":9,"n_cols":3,"rows_kept":9,"cut":false,"hidden":false,"merged":[]}
["こちらのシートは核酸抽出からご希望のお客様のみご記入ください。"]
[]
["サンプル生物種","選択してください",{"$f":"VLOOKUP(B3,マクロジェン使用欄!A195:B204,2,FALSE)","v":" "}]
["※必ず先にサンプル生物種をご選択ください。"]
["検体種類","選択してください",{"$f":"VLOOKUP(B5,マクロジェン使用欄!A175:B193,2,FALSE)","v":" "}]
[]
["懸濁(破砕)Buffer"]
[null,"※自由記入欄、ない場合は「無し」とご記入ください。"]
[null,"※RNAlaterのような保存液、TriZol、QIAzol以外に懸濁されている場合は、弊社で対応可能かご確認ください。"]

{"sheet":"サンプル条件一覧","index":6,"n_rows":78,"n_cols":9,"rows_kept":78,"cut":false,"hidden":false,"merged":[[77,0,77,7],[31,0,33,0],[2,0,2,1],[60,0,65,0],[6,0,8,0],[16,0,22,0],[48,0,59,0],[29,0,29,6],[9,0,15,0],[23,0,27,0],[37,0,47,0]]}
["Sample Quality Check(QC)の際にsampleを2-3ulを使用します。Sample volumeは余裕をもってご準備下さい。"]
["下記サンプル基準は2023年10月18日時点の基準となります。"]
[]
["Illumina DNA Library"]
["ライブラリー調製に使用するKitをご確認の上、下記条件のDNAをご準備ください。"]
["Library Type ","Library Kit ","Sample Type","Total Amount","Conc.","DIN","etc"]
["Amplicon DNA library ","Metagenome Amplicon","gDNA",null,"> 0.1ng/ul",null,">10ul"]
[null,"target amplicon DNA (2nd PCR)","Amplicon",null,"> 0.1ng/ul",null,">10ul"]
[null,"TruSeq Nano DNA (LMW)","Amplicon etc."," 0.1ug"]
["Targeted DNA library","SureSelect V5, V6, V7, V8","gDNA","0.5ug",null,"7.0"]
[null,"SureSelect V5, V6, V7, V8","FFPE由来gDNA","0.2ug"]
[null,"SureSelect Mouse ","gDNA","0.5ug",null,"7.0"]
[null,"Twist Human Core Exome","gDNA","0.05ug",null,"7.0"]
[null,"Twist Human Core Exome","FFPE由来gDNA","0.2ug"]
[null,"SureSelect Human Methyl-seq","gDNA","3.0ug",null,"7.0"]
[null,"SureSelect Mouse Methyl-seq","gDNA","3.0ug",null,"7.0"]
["Whole Genome library ","TruSeq Nano DNA (350) ","gDNA","0.1ug",null,"7.0"]
[null,"TruSeq Nano DNA (550) ","gDNA","0.2ug",null,"7.0"]
[null,"TruSeq DNA PCR Free (350)","gDNA","1.0ug",null,"7.0"]
[null,"TruSeq DNA PCR Free (550) ","gDNA","2.0ug",null,"7.0"]
[null,"Nextera DNA XT ","gDNA","0.001ug",null,"7.0"]
[null,"Accel Methyl-Seq DNA library ","gDNA","0.2ug",null,7]
[null,"TruSeq ChIP-seq library ","gDNA","0.01ug"]
["Shotgun Metagenome\nLibrary","TruSeq Nano DNA (350) ","gDNA","0.1ug",null,3]
[null,"TruSeq Nano DNA (550) ","gDNA","0.2ug",null,3]
[null,"TruSeq DNA PCR Free (350)","gDNA","1.0ug",null,3]
[null,"Nextera DNA XT ","gDNA","0.001ug",null,3]
[null,"illumina DNA Prep.","gDNA","0.05ug",null,7]
["PacBio　DNA Library"]
["ライブラリー調製に使用するKitをご確認の上、下記条件のDNAをご準備ください。"]
{"$rows_left_out":49}
{"sheet":"マクロジェン使用欄","index":7,"n_rows":204,"n_cols":17,"rows_kept":204,"cut":false,"hidden":true,"merged":[]}
[null,null,null,null,null,null,null,null,null,null,null,null,null,null,null,"Whole_Genome_Sequencing ","全ゲノムシーケンス"]
["NovaSeq_どちらでも可","RNA_Seq",null,null,null,null,null,null,null,null,null,null,null,null,null,"Exome_Sequencing","全エキソームシーケンス"]
["NovaSeq_X_Plus","Whole_Genome_Sequencing ","Exome_Sequencing","Transcriptome_Sequencing","Library_Sequencing","others",null,null,null,null,null,null,null,null,null,"Transcriptome_Sequencing","網羅的遺伝子発現解析(RNA-Seq)"]
["NovaSeq6000","Whole_Genome_Sequencing ","Exome_Sequencing","Transcriptome_Sequencing","Library_Sequencing","Amplicon_Sequencing","Methylation_WGBS_Sequencing","Target_Methylation_Suquencing","ChIP_Sequencing","Metagenome_Shotgun_Sequencing","Small_RNA_Sequencing","others",null,null,null,"Library_Sequencing","調製済みライブラリーのシーケンス"]
["MiSeq","Metagenome_16s_18s_Sequencing","Amplicon_Sequencing","Library_Sequencing","Whole_Genome_Sequencing ","others",null,null,null,null,null,null,null,null,null,"Amplicon_Sequencing","PCR産物などの低分子DNAのシーケンス"]
["NextSeq","Library_Sequencing","others",null,null,null,null,null,null,null,null,null,null,null,null,"Methylation_WGBS_Sequencing","メチル化解析を目的とした全ゲノムバイサルファイトシーケンス"]
["PacBio_SequelⅡ","Whole_Genome_Sequencing ","Amplicon_Sequencing","Library_Sequencing","Iso_Seqeuncing","others",null,null,null,null,null,null,null,null,null,"Target_Methylation_Suquencing","メチル化解析を目的としたターゲットエンリッチメントシーケンス"]
["PacBio_Revio","Whole_Genome_Sequencing ","Library_Sequencing","others",null,null,null,null,null,null,null,null,null,null,null,"Metagenome_Shotgun_Sequencing","ショットガンメタゲノム解析"]
["others",null,null,null,null,null,null,null,null,null,null,null,null,null,null,"Small_RNA_Sequencing","Small RNAをターゲットとした発現解析"]
[null,null,null,null,null,null,null,null,null,null,null,null,null,null,null,"others","その他"]
["RNA_Seq","TruSeq stranded mRNA Library","TruSeq stranded Total RNA / Ribo-zero Plus","TruSeq RNA Exome(Access)",null,null,null,null,null,null,null,null,null,null,null,"Metagenome_16s_18s_Sequencing","細菌叢解析"]
["Whole_Genome_Sequencing ","TruSeq Nano DNA Library","TruSeq DNA PCR-free Library","SMRTbell Prep Kit","others",null,null,null,null,null,null,null,null,null,null,"ChIP_Sequencing","クロマチン免疫沈降を行ったDNAのシーケンス"]
["Exome_Sequencing","SureSelect Human V6","SureSelect Human V6 + COSMIC","SureSelect Human V6 + UTR","SureSelect Human V5","SureSelect Human V7","SureSelect Human V8","SureSelect mouse","Twist Human Core Exome","Twist Human Core Exome 2.0","Twist Human Core Exome + RefSeq","others",null,null,null,"Iso_Seqeuncing","PacBioを使用した転写産物の全長解析"]
["Transcriptome_Sequencing","TruSeq stranded mRNA Library","TruSeq stranded Total RNA / Ribo-zero Plus","TruSeq stranded Total RNA / Ribo-zero Gold","TruSeq stranded Total RNA / Ribo-zero Globin","TruSeq stranded Total RNA / Ribo-zero Plant","TruSeq stranded Total RNA Library(bacteria)","SMARTer stranded RNA (Ribo-Zero)","SMARTer stranded RNA (PolyA)","SMARTer Universal Low Input RNA Kit","SMART-Seq Ultra low input RNA Kit","TruSeq RNA Exome(Access)","SureSelect RNA Direct","others",null,"RNA_Seq","網羅的遺伝子発現解析(RNA-Seq)"]
["Amplicon_Sequencing","TruSeq nano DNA Library","SMRTbell Prep Kit","Amplicon　2ndPCRから","others"]
["Library_Sequencing","調製済み"]
["Methylation_WGBS_Sequencing","Accel-NGS Methyl-Seq DNA Library","others"]
["Target_Methylation_Suquencing","SureSelect Human Methyl-seq","SureSelect Mouse Methyl-seq","others"]
["ChIP_Sequencing","TruSeq ChIP Library"]
["Iso_Seqeuncing","SMRTbell Prep Kit"]
["Metagenome_Shotgun_Sequencing","TruSeq Nano DNA Library","TruSeq DNA PCR-free Library","Nextera DNA XT Kit","Illumina DNA Prep. Kit","others"]
["Metagenome_16s_18s_Sequencing","16S rRNA(V3-V4)　1stPCRから","18S rRNA(ITS)　1stPCRから","others"]
["Small_RNA_Sequencing","TruSeq small RNA Library","SMARTer smRNA-Seq Kit","NEBNext Small RNA library","others"]
["others","others"]
[null,null,"Single End"]
["50bp"," ","Paired End"]
["75bp","NestSeqのみ","PacBio"]
["100bp","　"]
["150bp","　"]
["250bp","MiSeqのみ"]
{"$rows_left_out":174}